{"text_format":"1","workbook":"xlsx","n_sheets":16,"sheets":["Inicio","Carta Gantt","Resumen","1.- Trabajos de Auditoría","2.- Trabajos de Consultoría","3.- Trabajos de Seguimiento","4.- Trabajos Rutinarios","5.- Trabajos Dirección","Calculo de horas disponibles","Detalle Capacitaciones","6.- Proyecto PAMC","7- Resumen de horas estimadas","formato_resumen","Instituciones","formato_resumen_old","datos"],"not_rendered":{"charts":0,"images":0,"macros":1,"external_links":0,"defined_names":214,"comments":7,"pivot_tables":0},"unopened":[],"bounds":{"document_bytes":16777216,"sheet_cells":100000,"rows_first":2000,"rows_last":500,"rows_between":2000,"halvings":0,"cell_chars":16384,"cell_head_chars":4096},"cells_cut":0,"cells_raw":0,"read":"whole","date_system":"1900"}

{"sheet":"Inicio","index":0,"n_rows":23,"n_cols":7,"rows_kept":23,"cut":false,"hidden":false,"merged":[[13,1,13,4],[2,1,2,4]]}
[1]
[]
[null,"Plan Anual de Auditoría"]
[null,"Ministerio","DESARROLLO SOCIAL Y FAMILIA","Año planificado:",2026,null,"  "]
[null,"Servicio","SERVICIO NACIONAL DE PROTECCIÓN ESPECIALIZADA A LA NIÑEZ Y ADOLESCENCIA","Versión enviada a CAIGG:","01"]
[null,"Servicio dependiente",null,"Fecha de emisión:","2025-12-29"]
{"$rows_left_out":18}
{"sheet":"Carta Gantt","index":1,"n_rows":29,"n_cols":15,"rows_kept":29,"cut":false,"hidden":false,"merged":[[3,3,3,14],[1,1,1,14],[3,1,4,1],[3,2,4,2]]}
[]
[null,"Carta Gantt"]
[]
[null,"Código Trabajo","Nombre / Identificación del Trabajo ","CARTA GANTT"]
[null,null,null,"E","F","M","A","M","J","J","A","S","O","N","D"]
[null,"ASEG-1","Aseguramiento de las obligaciones del artículo 2° Quáter de la ley N°21.131, que establece pago a 30 días, en el sector público. (Objetivo gubernamental N°5).",null,"X","X"]
{"$rows_left_out":24}
{"sheet":"Resumen","index":2,"n_rows":84,"n_cols":17,"rows_kept":84,"cut":false,"hidden":false,"merged":[[79,1,79,2],[79,3,79,11],[80,1,80,2],[80,3,80,11],[82,6,82,9],[83,6,83,9],[59,1,59,16],[68,1,68,4],[76,1,76,11],[77,1,77,2],[77,3,77,11],[78,1,78,2],[78,3,78,11],[6,2,6,5],[6,7,6,10],[8,1,8,16],[20,1,20,14],[26,1,26,16],[35,1,35,12],[1,1,1,12],[3,2,3,5],[3,7,3,10],[4,2,4,5],[4,7,4,10],[5,2,5,5],[5,7,5,10]]}
[]
[null,"Plan Anual de Auditoría "]
[]
[null,"Ministerio: ","DESARROLLO SOCIAL Y FAMILIA",null,null,null,"Año planificado",2026]
[null,"Servicio:","SERVICIO NACIONAL DE PROTECCIÓN ESPECIALIZADA A LA NIÑEZ Y ADOLESCENCIA",null,null,null,"Versión",1]
[null,"Servicio dependiente",null,null,null,null,"Fecha de Emisión:","29-12-2025"]
{"$rows_left_out":79}
{"sheet":"1.- Trabajos de Auditoría","index":3,"n_rows":200,"n_cols":16,"rows_kept":200,"cut":false,"hidden":false,"merged":[[1,0,1,11]]}
[1]
["1.- Trabajos de Auditoría Priorizados en Base al Análisis de Riesgos"]
[]
["Código del Trabajo de Auditoría ","Nombre del Trabajo","Tipo de Trabajo","Objetivo de Auditoría General del Trabajo","Proceso Transversal en el Estado ","Relación Procesos G - GR - C","Tipo Relación","Alcance General","Frecuencia","Riesgos Críticos Globales","Número de Auditores","Horas de Auditoría","Mes Inicio","Mes Término","Cantidad de Informes que se remitirán al CAIGG, asociados al Trabajo","Fecha estimada de envío del Informe al CAIGG"]
["ASEG-1","Aseguramiento de las obligaciones del artículo 2° Quáter de la ley N°21.131, que establece pago a 30 días, en el sector público. (Objetivo gubernamental N°5).","Gubernamental (G)","Evaluar la efectividad de los controles asociados al cumplimiento del artículo 2° Quáter de la ley Nº21.131, sobre pago a 30 días, de manera tal que el resultado del trabajo de auditoría permita informar a la dirección sobre si los riesgos de cumplimiento están en un nivel aceptable y en base a ello, que se tomen las acciones adecuadas para su mitigación.","Financiero",{"$f":"IFERROR((INDEX(datos!$U$2:$U$58,MATCH(E5,datos!$T$2:$T$58,0))),\"\")","v":"Gobierno, Gestión de Riesgos, Control"},{"$f":"IFERROR((INDEX(datos!$V$2:$V$58,MATCH(E5,datos!$T$2:$T$58,0))),\"\")","v":"Indirecta"},"Período por considerar desde el 01/01/2024 hasta el 31/12/2024.","Anual","Que no se adopten e implementen medidas para efectuar el pago a proveedores conforme lo establece la ley.",1,323,"Febrero","Marzo",1,"2026-03-31"]
["ASEG-2","Realización de actividades asociadas a requerimientos del Consejo de Auditoría Interna General de Gobierno. (Objetivo Gubernamental N°6).","Gubernamental (G)","Por definir conforme a instrucciones que entregue el Consejo de Auditoría durante el año 2026.",null,{"$f":"IFERROR((INDEX(datos!$U$2:$U$58,MATCH(E6,datos!$T$2:$T$58,0))),\"\")","v":""},{"$f":"IFERROR((INDEX(datos!$V$2:$V$58,MATCH(E6,datos!$T$2:$T$58,0))),\"\")","v":""},null,null,null,2,1120,"Agosto","Diciembre",2,"La que instruya el CAIGG"]
{"$rows_left_out":195}
{"sheet":"2.- Trabajos de Consultoría","index":4,"n_rows":200,"n_cols":14,"rows_kept":200,"cut":false,"hidden":false,"merged":[[1,0,1,11]]}
[2]
["2.- Trabajos de Consultoría"]
[]
["Código del trabajo de Consultoría","Nombre del Trabajo","Objetivo General del Trabajo de  Consultoría","Tipo de Trabajo","Proceso Transversal en el Estado ","Relación Procesos G - GR - C","Tipo Relación","Frecuencia","Cantidad de Auditores","Horas de Auditoría","Mes Inicio","Mes Término","Cantidad de Informes que se remitirán al CAIGG, asociados al Trabajo","Fecha estimada de envío del Informe al CAIGG"]
[null,null,null,null,null,{"$f":"IFERROR((INDEX(datos!$U$2:$U$58,MATCH(E5,datos!$T$2:$T$58,0))),\"\")","v":""},{"$f":"IFERROR((INDEX(datos!$V$2:$V$58,MATCH(E5,datos!$T$2:$T$58,0))),\"\")","v":""}]
[null,null,null,null,null,{"$f":"IFERROR((INDEX(datos!$U$2:$U$58,MATCH(E6,datos!$T$2:$T$58,0))),\"\")","v":""},{"$f":"IFERROR((INDEX(datos!$V$2:$V$58,MATCH(E6,datos!$T$2:$T$58,0))),\"\")","v":""}]
{"$rows_left_out":195}
{"sheet":"3.- Trabajos de Seguimiento","index":5,"n_rows":200,"n_cols":16,"rows_kept":200,"cut":false,"hidden":false,"merged":[[1,0,1,13]]}
[3]
["3.- Trabajos de Seguimiento"]
[]
["Código del Trabajo de Seguimiento","Nombre del Trabajo","Tipo de Trabajo","Objetivo de Auditoría General del Trabajo","Materia de Seguimiento","Proceso Transversal en el Estado ","Relación Procesos G - GR - C","Tipo Relación","Frecuencia","Incluye anexo con Compromisos Pendientes de Implementar","Número de Auditores","Horas de Auditoría","Mes Inicio","Mes Término","Cantidad de Informes que se remitirán al CAIGG, asociados al Trabajo","Fecha estimada de envío del Informe al CAIGG"]
["SEG-1","OG2_Seguimiento a los compromisos y acciones implementadas contraídas en Auditorías Internas: COSO.","Gubernamental (G)","Verificar el estado de implementación de las acciones comprometidas en la auditoría 2025.","Compromisos por Auditorías Internas","Auditoría Interna",{"$f":"IFERROR((INDEX(datos!$U$2:$U$58,MATCH(F5,datos!$T$2:$T$58,0))),\"\")","v":"Gobierno, Gestión de Riesgos, Control"},{"$f":"IFERROR((INDEX(datos!$V$2:$V$58,MATCH(F5,datos!$T$2:$T$58,0))),\"\")","v":"Indirecta"},"Anual","SI",1,24,"Febrero","Febrero",1,"2026-02-27"]
["SEG-2","Seguimiento Plan de Auditoría año 2026.","Gubernamental (G)","Controlar el cumplimiento del Plan Anual de Auditoría 2026.","Actividades definidas en el Plan anual","Auditoría Interna",{"$f":"IFERROR((INDEX(datos!$U$2:$U$58,MATCH(F6,datos!$T$2:$T$58,0))),\"\")","v":"Gobierno, Gestión de Riesgos, Control"},{"$f":"IFERROR((INDEX(datos!$V$2:$V$58,MATCH(F6,datos!$T$2:$T$58,0))),\"\")","v":"Indirecta"},"Trimestral","SI",1,24,"Abril","Octubre",3,"10/04/2026; 10/07/2026; 09/10/2026"]
{"$rows_left_out":195}
{"sheet":"4.- Trabajos Rutinarios","index":6,"n_rows":200,"n_cols":12,"rows_kept":200,"cut":false,"hidden":false,"merged":[[1,0,1,11]]}
[4]
["4.- Trabajos Rutinarios y Obligatorios por Normativa"]
[]
["Código del Trabajo Rutinario","Nombre del Trabajo","Tipo de Trabajo","Objetivo de Auditoría General del Trabajo","Proceso Transversal en el Estado ","Relación Procesos G - GR - C","Tipo Relación","Frecuencia","Número de Auditores","Horas de Auditoría","Mes Inicio","Mes Término"]
["RUT-1","Reuniones trimestrales con los responsables de las actividades pendientes de implementar, contenidas en los Informes finales o de seguimiento de la Contraloría General de la República mediana y levemente complejas. Revisión y análisis de verificadores y emisión de informes.","Institucional (I)","Realizar actividades de seguimiento al 100% de los compromisos adquiridos por el Servicio, a las observaciones contenidas e Informes de la Contraloría General de la República, mediana y levemente complejas.","Auditoría Interna",{"$f":"IFERROR((INDEX(datos!$U$2:$U$58,MATCH(E5,datos!$T$2:$T$58,0))),\"\")","v":"Gobierno, Gestión de Riesgos, Control"},{"$f":"IFERROR((INDEX(datos!$V$2:$V$58,MATCH(E5,datos!$T$2:$T$58,0))),\"\")","v":"Indirecta"},"Trimestral",1,150,"Marzo","Diciembre"]
["RUT-2","Reuniones trimestrales con los responsables de los compromisos pendientes de implementar, según Informes de Auditoría Interna. Revisión y análisis de verificadores y emisión de informes. ","Institucional (I)","Realizar actividades de seguimiento al 100% de los compromisos adquiridos por el Servicio, a las observaciones contenidas en informes por auditorías internas.","Auditoría Interna",{"$f":"IFERROR((INDEX(datos!$U$2:$U$58,MATCH(E6,datos!$T$2:$T$58,0))),\"\")","v":"Gobierno, Gestión de Riesgos, Control"},{"$f":"IFERROR((INDEX(datos!$V$2:$V$58,MATCH(E6,datos!$T$2:$T$58,0))),\"\")","v":"Indirecta"},"Trimestral",1,200,"Marzo","Diciembre"]
{"$rows_left_out":195}
{"sheet":"5.- Trabajos Dirección","index":7,"n_rows":200,"n_cols":16,"rows_kept":200,"cut":false,"hidden":false,"merged":[[1,0,1,11]]}
[5]
["5.- Trabajos Solicitados por el Jefe de Servicio"]
[]
["Código del Trabajo Solicitado","Nombre del Trabajo","Clasificación del trabajo ","Tipo de Trabajo","Objetivo General de Auditoría","Proceso Transversal en el Estado ","Relación Procesos G - GR - C","Tipo Relación","Frecuencia","Riesgos Críticos Globales (en caso que trabajo sea de Aseguramiento)","Número de Auditores","Horas de Auditoría","Mes Inicio","Mes Término","Cantidad de Informes que se remitirán al CAIGG, asociados al Trabajo","Fecha estimada de envío del Informe al CAIGG"]
["DIR-1","Auditoría de gestión e impacto sobre \nla línea de cuidados alternativos administrados por colaboradores acreditados (art. 24, Ley N°21.302) en la línea de familias de acogida.","Aseguramiento","Institucional","Revisión de los procesos de gestión, productos, resultados, efectos y seguimiento de proyectos de Cuidados Alternativos, modalidad Familias de Acogida administradas por Colaboradores Acreditados , para verificar el cumplimiento de lineamientos y normativas vigentes, junto con evaluar la calidad y oportunidad de la aplicación de controles internos, con la finalidad de contribuir a la gestión directiva del Servicio, para el logro y cumplimiento de su Misión, Objetivos Estratégicos y prioridades institucionales del período.\n","Auditoría Interna",{"$f":"IFERROR((INDEX(datos!$U$2:$U$58,MATCH(F5,datos!$T$2:$T$58,0))),\"\")","v":"Gobierno, Gestión de Riesgos, Control"},{"$f":"IFERROR((INDEX(datos!$V$2:$V$58,MATCH(F5,datos!$T$2:$T$58,0))),\"\")","v":"Indirecta"},"Anual","Los procesos de ingreso, evaluación, acompañamiento y egreso no cumplen con los plazos y estándares.\nRuptura de acogimiento, sobreocupación, deserción de familias, etc.\nInexistencia de medidas de control y monitoreo permanente hacia las familias.",1,320,"Enero","Febrero",1,"2026-03-10"]
[null,null,null,null,null,null,{"$f":"IFERROR((INDEX(datos!$U$2:$U$58,MATCH(F6,datos!$T$2:$T$58,0))),\"\")","v":""},{"$f":"IFERROR((INDEX(datos!$V$2:$V$58,MATCH(F6,datos!$T$2:$T$58,0))),\"\")","v":""}]
{"$rows_left_out":195}
{"sheet":"Calculo de horas disponibles","index":8,"n_rows":24,"n_cols":3,"rows_kept":24,"cut":false,"hidden":false,"merged":[[23,1,23,2],[0,0,0,2],[16,1,16,2],[8,1,8,2],[3,1,3,2]]}
["Cálculo de Horas Disponibles"]
[]
[]
[null,"Cálculo de días disponibles"]
[null,"Número de Funcionarios de la Unidad de Auditoría Interna",4]
[null,"Total de días hábiles del año planificado",249.5]
{"$rows_left_out":19}
{"sheet":"Detalle Capacitaciones","index":9,"n_rows":150,"n_cols":7,"rows_kept":150,"cut":false,"hidden":false,"merged":[[1,1,1,3],[1,4,1,6]]}
[]
[null,"Total de horas estimadas para Capacitaciones año planificado",null,null,{"$f":"SUM(G4:G150)","v":130}]
[null,"Nombre Actividad Capacitación","Proveedor Capacitación (CAIGG-CGR- Otros)","Especificar otro proveedor","Número de participantes","Horas Actividad","Horas totales"]
[null,"Fundamentos de las normas globales de auditoría interna del Instituto de Auditores Internos (IIA).","CAIGG",null,1,9,{"$f":"E4*F4","v":9}]
[null,"Aplicación de las directrices del CAIGG en base a al dominio y desempeño de los servicios de auditoría interna de las normas globales de auditoría interna","CAIGG",null,4,16,{"$f":"E5*F5","v":64}]
[null,"Elaboración de informes de auditoría en base a las directrices técnicas del CAIGG","CAIGG",null,1,9,9]
{"$rows_left_out":145}
{"sheet":"6.- Proyecto PAMC","index":10,"n_rows":50,"n_cols":4,"rows_kept":50,"cut":false,"hidden":false,"merged":[[1,0,1,3]]}
[6]
["6.- Proyecto Programa de Aseguramiento y Mejora de la Calidad (PAMC)"]
[]
[]
[]
["Cantidad de funcionarios de la unidad de auditoría interna"]
{"$rows_left_out":45}
{"sheet":"7- Resumen de horas estimadas","index":11,"n_rows":14,"n_cols":2,"rows_kept":14,"cut":false,"hidden":false,"merged":[[13,1,13,5],[8,1,8,5],[9,1,9,5],[10,1,10,5],[12,1,12,5],[11,1,11,5],[1,0,1,6],[4,1,4,5],[5,1,5,5],[6,1,6,5],[7,1,7,5]]}
[7]
["7.- Estimación de  Horas Totales Disponibles"]
[]
[]
["Cantidad Horas disponibles año 20XX",6432]
["Total Horas definidas en Trabajos de aseguramiento",3523]
{"$rows_left_out":9}
{"sheet":"formato_resumen","index":12,"n_rows":56,"n_cols":17,"rows_kept":56,"cut":false,"hidden":true,"merged":[[26,1,26,12],[1,1,1,12],[3,2,3,5],[3,7,3,10],[4,2,4,5],[4,7,4,10],[5,2,5,5],[5,7,5,10],[6,2,6,5],[6,7,6,10],[8,1,8,16],[14,1,14,14],[20,1,20,16],[55,6,55,9],[33,1,33,16],[40,1,40,4],[48,1,48,11],[49,1,49,2],[49,3,49,11],[50,1,50,2],[50,3,50,11],[51,1,51,2],[51,3,51,11],[52,1,52,2],[52,3,52,11],[54,6,54,9]]}
[]
[null,"Plan Anual de Auditoría "]
[]
[null,"Ministerio: ",null,null,null,null,"Año planificado"]
[null,"Servicio:",null,null,null,null,"Versión"]
[null,"Servicio dependiente",null,null,null,null,"Fecha de Emisión:"]
{"$rows_left_out":51}
{"sheet":"Instituciones","index":13,"n_rows":127,"n_cols":71,"rows_kept":127,"cut":false,"hidden":true,"merged":[]}
["MINISTERIO","AGRICULTURA","BIENES NACIONALES","CIENCIA TECNOLOGÍA CONOCIMIENTO E INNOVACIÓN","CULTURAS LAS ARTES Y EL PATRIMONIO CULTURAL","DEFENSA NACIONAL","DEPORTE","DESARROLLO SOCIAL Y FAMILIA","ECONOMÍA FOMENTO Y TURISMO","EDUCACIÓN","ENERGÍA","HACIENDA","INTERIOR","JUSTICIA Y DERECHOS HUMANOS","MEDIO AMBIENTE","MINERÍA","MUJER Y LA EQUIDAD DE GÉNERO","OBRAS PÚBLICAS","PRESIDENCIA DE LA REPÚBLICA","RELACIONES EXTERIORES","SALUD","SECRETARÍA GENERAL DE GOBIERNO","SECRETARÍA GENERAL DE LA PRESIDENCIA DE LA REPÚBLICA","SEGURIDAD PÚBLICA","TRABAJO Y PREVISIÓN SOCIAL","TRANSPORTES Y TELECOMUNICACIONES","VIVIENDA Y URBANISMO","REGIÓN","EMPRESAS ESTADO","DIVISIÓN"]
["AGRICULTURA","CENTRO DE INFORMACIÓN DE RECURSOS NATURALES","SUBSECRETARÍA DE BIENES NACIONALES","AGENCIA NACIONAL DE INVESTIGACIÓN Y DESARROLLO","SERVICIO NACIONAL DEL PATRIMONIO CULTURAL","ACADEMIA NACIONAL DE ESTUDIOS POLÍTICOS Y ESTRATÉGICOS","INSTITUTO NACIONAL DE DEPORTES ","CORPORACIÓN NACIONAL DE DESARROLLO INDÍGENA","AGENCIA DE PROMOCIÓN DE LA INVERSIÓN EXTRANJERA","AGENCIA DE CALIDAD DE LA EDUCACIÓN","COMISIÓN CHILENA DE ENERGÍA NUCLEAR","COMISIÓN PARA EL MERCADO FINANCIERO","SERVICIO NACIONAL DE MIGRACIONES","CORPORACIÓN DE ASISTENCIA JUDICIAL BIOBÍO","SERVICIO DE BIODIVERSIDAD Y ÁREAS PROTEGIDAS","COMISIÓN CHILENA DEL COBRE","SERVICIO NACIONAL DE LA MUJER Y LA EQUIDAD DE GÉNERO","DIRECCIÓN DE AEROPUERTOS","DIRECCIÓN ADMINISTRATIVA DE LA PRESIDENCIA","AGENCIA CHILENA DE COOPERACIÓN INTERNACIONAL PARA EL DESARROLLO","CENTRAL DE ABASTECIMIENTO DEL SISTEMA NACIONAL DE SERVICIOS DE SALUD","SUBSECRETARÍA GENERAL DE GOBIERNO","SUBSECRETARÍA GENERAL DE LA PRESIDENCIA DE LA REPÚBLICA","AGENCIA NACIONAL DE CIBERSEGURIDAD","COMISIÓN DEL SISTEMA NACIONAL DE CERTIFICACIÓN DE COMPETENCIAS LABORALES (CHILEVALORA)","JUNTA DE AERONÁUTICA CIVIL","PARQUE METROPOLITANO DE SANTIAGO","DE ARICA Y PARINACOTA","ASTILLEROS Y MAESTRANZAS DE LA ARMADA","AUDITORÍA ADMINISTRATIVA"]
["BIENES NACIONALES","COMISIÓN NACIONAL DE RIEGO",null,"SUBSECRETARÍA DE CIENCIA, TECNOLOGÍA, CONOCIMIENTO E INNOVACIÓN","SUBSECRETARÍA DE LAS CULTURAS Y LAS ARTES","ARMADA DE CHILE","SUBSECRETARÍA DEL DEPORTE","FONDO DE SOLIDARIDAD E INVERSIÓN SOCIAL","CORPORACIÓN DE FOMENTO DE LA PRODUCCIÓN","COMISIÓN NACIONAL DE ACREDITACIÓN","COMISIÓN NACIONAL DE ENERGÍA","CONSEJO DE DEFENSA DEL ESTADO","SERVICIO NACIONAL DE PREVENCIÓN Y RESPUESTA ANTE DESASTRES","CORPORACIÓN DE ASISTENCIA JUDICIAL METROPOLITANA","SERVICIO DE EVALUACIÓN AMBIENTAL","SERVICIO NACIONAL DE GEOLOGÍA Y MINERÍA","SUBSECRETARÍA DE LA MUJER Y LA EQUIDAD DE GÉNERO","DIRECCIÓN DE ARQUITECTURA",null,"DIRECCIÓN GENERAL DE PROMOCIÓN DE EXPORTACIONES","CENTRO DE REFERENCIA DE SALUD DE MAIPÚ",null,null,"CARABINEROS DE CHILE","DIRECCIÓN DEL TRABAJO ","SUBSECRETARÍA DE TELECOMUNICACIONES","SERVIU REGIÓN DE ARICA Y PARINACOTA","DE TARAPACÁ","CASA DE MONEDA DE CHILE S.A.","AUDITORÍAS ESPECIALES"]
["CIENCIA TECNOLOGÍA CONOCIMIENTO E INNOVACIÓN","CORPORACIÓN NACIONAL FORESTAL",null,null,"SUBSECRETARÍA DEL PATRIMONIO CULTURAL","CAJA DE PREVISIÓN DE LA DEFENSA NACIONAL",null,"INSTITUTO NACIONAL DE LA JUVENTUD","FISCALÍA NACIONAL ECONÓMICA","CONSEJO NACIONAL DE EDUCACIÓN","SUBSECRETARÍA DE ENERGÍA","DEFENSORÍA DEL CONTRIBUYENTE","SERVICIO NACIONAL PARA LA PREVENCIÓN Y REHABILITACIÓN DEL CONSUMO DE DROGAS Y ALCOHOL","CORPORACIÓN DE ASISTENCIA JUDICIAL TARAPACÁ Y ANTOFAGASTA","SUBSECRETARÍA DEL MEDIO AMBIENTE","SUBSECRETARÍA DE MINERÍA",null,"DIRECCIÓN DE CONTABILIDAD Y FINANZAS",null,"DIRECCIÓN NACIONAL DE FRONTERAS Y LÍMITES DEL ESTADO ","CENTRO DE REFERENCIA DE SALUD DE PEÑALOLÉN CORDILLERA ORIENTE",null,null,"DIRECCIÓN DE PREVISIÓN DE CARABINEROS DE CHILE","DIRECCIÓN GENERAL DE CRÉDITO PRENDARIO ","SUBSECRETARÍA DE TRANSPORTES","SERVIU REGIÓN DE TARAPACÁ","DE ANTOFAGASTA","CENTRO DE INVESTIGACIÓN  MINERA Y METALÚRGICA ","CGR REGIONAL"]
["CULTURAS LAS ARTES Y EL PATRIMONIO CULTURAL","FUNDACIÓN DE COMUNICACIÓN, CAPACITACIÓN Y CULTURA DEL AGRO",null,null,null,"DEFENSA CIVIL DE CHILE",null,"SERVICIO NACIONAL DE LA DISCAPACIDAD","INSTITUTO NACIONAL DE DESARROLLO SUSTENTABLE DE LA PESCA ARTESANAL Y DE LA ACUICULTURA DE PEQUEÑA ESCALA","DIRECCIÓN DE EDUCACIÓN PÚBLICA","SUPERINTENDENCIA DE ELECTRICIDAD Y COMBUSTIBLES","DIRECCIÓN DE COMPRAS Y CONTRATACIÓN PÚBLICA","SUBSECRETARÍA DE DESARROLLO REGIONAL Y ADMINISTRATIVO","CORPORACIÓN DE ASISTENCIA JUDICIAL VALPARAÍSO","SUPERINTENDENCIA DEL MEDIO AMBIENTE",null,null,"DIRECCIÓN DE OBRAS HIDRÁULICAS",null,"INSTITUTO ANTÁRTICO CHILENO ","FONDO NACIONAL DE SALUD",null,null,"POLICIA DE INVESTIGACIONES","INSTITUTO DE PREVISIÓN SOCIAL ",null,"SERVIU REGIÓN DE ANTOFAGASTA","DE ATACAMA","COMERCIALIZADORA DE TRIGO S.A.","INFRAESTRUCTURA Y REGULACIÓN"]
["DEFENSA NACIONAL","FUNDACIÓN PARA LA INNOVACIÓN AGRARIA",null,null,null,"DIRECCIÓN GENERAL DE AERONÁUTICA CIVIL",null,"SERVICIO NACIONAL DE PROTECCIÓN ESPECIALIZADA A LA NIÑEZ Y ADOLESCENCIA","INSTITUTO NACIONAL DE ESTADÍSTICAS","JUNTA NACIONAL DE AUXILIO ESCOLAR Y BECAS",null,"DIRECCIÓN DE PRESUPUESTOS","SUBSECRETARÍA DEL INTERIOR","DEFENSORÍA PENAL PÚBLICA",null,null,null,"DIRECCIÓN DE OBRAS PORTUARIAS",null,"SUBSECRETARÍA DE RELACIONES ECONÓMICAS INTERNACIONALES","INSTITUTO DE SALUD PÚBLICA",null,null,"SUBSECRETARÍA DE PREVENCIÓN DEL DELITO","INSTITUTO DE SEGURIDAD LABORAL ",null,"SERVIU REGIÓN DE ATACAMA","DE COQUIMBO","CORPORACIÓN NACIONAL DEL COBRE","TOMA DE RAZÓN Y REGISTRO"]
{"$rows_left_out":122}
{"sheet":"formato_resumen_old","index":14,"n_rows":47,"n_cols":17,"rows_kept":47,"cut":false,"hidden":true,"merged":[[46,6,46,9],[33,1,33,16],[39,1,39,11],[40,1,40,2],[40,3,40,11],[41,1,41,2],[41,3,41,11],[42,1,42,2],[42,3,42,11],[43,1,43,2],[43,3,43,11],[45,6,45,9],[26,1,26,12],[1,1,1,12],[3,2,3,5],[3,7,3,10],[4,2,4,5],[4,7,4,10],[5,2,5,5],[5,7,5,10],[6,2,6,5],[6,7,6,10],[8,1,8,16],[14,1,14,14],[20,1,20,16]]}
[]
[null,"Plan Anual de Auditoría "]
[]
[null,"Ministerio: ",null,null,null,null,"Año planificado:"]
[null,"Servicio:",null,null,null,null,"Versión:"]
[null,"Servicio dependiente:",null,null,null,null,"Fecha de emisión:"]
{"$rows_left_out":42}
{"sheet":"datos","index":15,"n_rows":404,"n_cols":24,"rows_kept":404,"cut":false,"hidden":true,"merged":[]}
["Validacion","Tipo","Meses","año","version","Frecuencia","tipo",null,"Servicio","Acronimo","Proveedor Capacitación ",null,null,null,null,null,"Numero informes",null,null,"PROC_TRANSV","NAT_AUD","RELACION_NAT",null,"Fases del Modelo de Calidad"]
[null,"Gubernamental (G)","Enero",2025,"01","Semanal","Consultoría",null,"CENTRO DE INFORMACIÓN DE RECURSOS NATURALES","CIREN","CAIGG",null,"Proveedor Capacitación (CAIGG-CGR- Otros)",null,"SI",null,1,null,"Auditoría","Subsidios a privados de fomento","Gobierno, Gestión de Riesgos, Control","Indirecta",null,"Fase I - Generación de Competencias"]
[null,"Ministerial (M)","Febrero",2026,"02","Quincenal","Aseguramiento",null,"COMISIÓN NACIONAL DE RIEGO","CNR","CGR","Institucional",null,null,"NO",null,2,null,"Consultoría","Subsidios a privados social","Gobierno, Gestión de Riesgos, Control","Indirecta",null,"Fase II - Diagnóstico de la Conformidad con las Normas y el Código de Ética del IIA"]
[null,"Institucional (I)","Marzo",null,"03","Mensual","Seguimiento",null,"CORPORACIÓN NACIONAL FORESTAL","CONAF","CAIGG - PAMC",null,null,null,null,null,3,null,"Seguimiento","Subsidios a privados asistencial","Gobierno, Gestión de Riesgos, Control","Indirecta",null,"Fase III – Formulación de Planes de Acción"]
[null,null,"Abril",null,"04","Trimestral","Otro",null,"FUNDACIÓN DE COMUNICACIÓN, CAPACITACIÓN Y CULTURA DEL AGRO","FUCOA","CGR - PAMC",null,null,null,null,null,4,null,"Rutinaria","Transferencias a/de otras entidades públicas","Gobierno, Gestión de Riesgos, Control","Indirecta",null,"Fase IV - Implementación Plan de Acción y Monitoreo"]
[null,null,"Mayo",null,"05","Semestral",null,null,"FUNDACIÓN PARA LA INNOVACIÓN AGRARIA","FIA","OTROS",null,null,null,null,null,5,null,"Dirección","Servicios de atención al ciudadano – contraprestación","Gobierno, Gestión de Riesgos, Control","Indirecta",null,"Fase V – Realización de Autoevaluaciones y Monitoreo"]
{"$rows_left_out":398}